BDBM50228540 CHEMBL317163
SMILES OC(CNCCNC(=O)c1ccc(cc1)-n1ccnc1)COc1cccc2ccccc12
InChI Key InChIKey=ZXVYBVNQYMWTEB-UHFFFAOYSA-N
Data  1 IC50
  Tab Delimited (TSV)   2D SDfile   Computed 3D by Vconf -m prep SDfile
Find this compound or compounds like it in BindingDB:
Activity Spreadsheet -- Enzyme Inhibition Constant Data from BindingDB
Found 1 hit for monomerid = 50228540
TargetBeta-1/Beta-2/Beta-3 adrenergic receptor(Homo sapiens (Human))
Berlex Laboratories
Curated by ChEMBL
LigandPNGBDBM50228540(CHEMBL317163)
Affinity DataIC50:  420nM. Assay description: Tested for Beta adrenergic receptor binding inhibition from canine ventricular tissue, using [3H]dihydroalprenolol as the radioligand in anesthetized...
In DepthDetails ArticlePubMed